{"text_format":"1","workbook":"xlsx","n_sheets":11,"sheets":["Quick Guide","Start","Merit Order","Power Plant List","Sources","Imprint","Start Reset","Backend I","Backend II","Power Plant List Backend","Hilfssheet Abbildung"],"not_rendered":{"charts":4,"images":6,"macros":1,"external_links":0,"defined_names":3,"comments":0,"pivot_tables":0},"unopened":[],"bounds":{"document_bytes":16777216,"sheet_cells":100000,"rows_first":2000,"rows_last":500,"rows_between":2000,"halvings":0,"cell_chars":16384,"cell_head_chars":4096},"cells_cut":0,"cells_raw":0,"read":"whole","date_system":"1900"}

{"sheet":"Quick Guide","index":0,"n_rows":32,"n_cols":5,"rows_kept":32,"cut":false,"hidden":false,"merged":[]}
[]
[]
[null,null," EWI Merit Order Tool 2021"]
[]
[null,null," Quick Guide",null,{"$f":"Imprint!F5","v":"Version 2021.4_en "}]
[]
[]
[null,null,null,"To be able to use all functions of the EWI Merit Order Tool 2021, macros must be activated."]
[]
[null,null,null,"Merit Order"]
[null,null,null,"A merit order is the order in which power plants operate on the electricity market. This is determined based on the marginal costs of the power plants, which are sorted in ascending order. As such, the merit order is an approximation of the actual supply curves, e.g., the day-ahead auction on the electricity exchange. The annual average merit order of the German power plant fleet gives a good indication of the relationships between the marginal costs of different power plants, relative to current conditions. The merit order is primarily influenced by the types of power plants in the fleet as well as the underlying fuel and emission certificate prices."]
[null,null,null," "]
[null,null,null,"The EWI Merit Order Tool 2021"]
[null,null,null,"The EWI Merit Order Tool 2021 allows the calculation and graphical representation of the annual average merit order based on the conventional power plant fleet in Germany in the year 2020. Users can vary the assumptions underlying the merit order to investigate the effects of changing fuel prices or other assumptions on the merit order. In addition, power plants can be removed or added to the merit order. Users can also analyze and visualise the impact of power plant decommissioning or additional installations on the merit order. By default, only the merit order of conventional power plants is displayed. In order to adjust the merit order to account for specific feed-in situations of renewable energy sources (RES), an assumption can also be made regarding the available RES capacity."]
[]
{"$rows_left_out":18}
{"sheet":"Start","index":1,"n_rows":40,"n_cols":16,"rows_kept":40,"cut":false,"hidden":false,"merged":[[6,2,6,5],[20,2,20,5],[30,7,30,10],[30,12,30,15],[16,2,16,5],[30,2,30,5],[6,7,6,15],[7,7,10,13]]}
[]
[]
[null,null," EWI Merit Order Tool 2021"]
[]
[null,null," Start",null,null,null,null,null,null,null,null,null,null,null,null,{"$f":"Imprint!F5","v":"Version 2021.4_en "}]
[]
[null,null,"Fuel Prices",null,null,null,null,"Overview Over the Marginal Costs of Power Plants"]
[null,null,"Fuel Type","Price","Unit","Source",null,"The boxplot diagram gives a first overview of the marginal cost distribution of power plants. In the illustration to the right of this text box, the individual elements of the diagram are explained. Changes in assumptions are reflected in the diagram immediately. In order to transfer the assumptions to the merit order in the Merit Order sheet, the button Update Merit Order must be clicked."]
[null,null,"Nuclear",5.5,"EUR/MWhth","refer to documentation"]
[null,null,"Lignite",3.1,"EUR/MWhth","EWI (2019)"]
[null,null,"Coal",6.25,"EUR/MWhth","VDKi (2020)"]
[null,null,"Gas",10.17,"EUR/MWhth","Spot TTF"]
[null,null,"Oil",22.9,"EUR/MWhth","SDKW (2019)"]
[null,null,"Waste",0,"EUR/MWhth","refer to documentation"]
[null,null,"Other",22.9,"EUR/MWhth","refer to documentation"]
{"$rows_left_out":26}
{"sheet":"Merit Order","index":2,"n_rows":546,"n_cols":11,"rows_kept":546,"cut":false,"hidden":false,"merged":[[9,2,9,10],[6,2,6,10]]}
[]
[]
[null,null," EWI Merit Order Tool 2021"]
[]
[null,null," Merit Order",null,null,null,null,null,null,null,{"$f":"Imprint!F5","v":"Version 2021.4_en "}]
[]
[null,null,"Visualization of the Merit Order"]
[]
[]
[null,null,"Merit Order in Tabular Form"]
[null,null,"Power Plant Identification Number of the Bundesnetzagentur","Company","Name of the Power Plant","Name of the Unit","Begin of Commercial Electricity Generation","Power Plant Type","Mean Available Net Nominal Capacity [MW]","Cumulated Available Net Nominal Capacity [MW]","Marginal Costs [EUR/MWhel]"]
[null,null,"BNA0084","Vattenfall Wärme Berlin AG","Reuter","Reuter M","30.10.1998","Waste",30.599999999999998,30.599999999999998,1]
[null,null,"BNA0088b","Solvay Chemicals GmbH","Dampfturbinenanlage der EBS-Kessel",null,"16.10.2009","Waste",29.75,60.349999999999994,1]
[null,null,"BNA0097","MVA Bielefeld-Herford GmbH","MVA Bielefeld","Linien 1 - 3","01.07.1981","Waste",28.9,89.25,1]
[null,null,"BNA0117a","Energie- und Wasserversorgung Bonn/Rhein-Sieg GmbH","Heizkraftwerk Karlstraße","Heizkraftwerk Karlstraße","01.07.1990","Waste",10.199999999999999,99.45,1]
{"$rows_left_out":532}
{"sheet":"Power Plant List","index":3,"n_rows":555,"n_cols":23,"rows_kept":555,"cut":false,"hidden":false,"merged":[[6,2,6,8]]}
[]
[]
[null,null," EWI Merit Order Tool 2021"]
[]
[null,null," Power Plant List",null,null,null,null,null,null,null,null,null,null,null,null,null,null,null,null,null,null,null,{"$f":"Imprint!F5","v":"Version 2021.4_en "}]
[]
[null,null," The power plant list is based on the power plant list of the Bundesnetzagentur (BNetzA, 2020). The list includes all conventional power plants that were in operation on 01.04.2020.\n The dark yellow columns are taken from BNetzA (2020) unaltered. The light yellow columns contain additional information based on own assumptions, calculations and other sources.\n For example, the assumptions on power plant efficiency are largely taken from OPSD (2018).\n The fields with white backgrounds can be adjusted by the users. For example, power plants can be removed from the merit order and up to 10 new power plants can be added."]
[]
[]
[null,null,"Included in the Merit Order?","Power Plant Identification Number of the Federal Network Agency","Company","Name of the Power Plant","Postal Code of the Plant's Location","City of the Power Plant","Street Name and Number of the Power Plant","State","Unit Name",{"$f":"'Merit Order'!G11","v":"Begin of Commercial Electricity Generation"},"Source of Energy (BNetzA, 2019)","Assumed Primary Source of Energy","Power Plant Type Assignment","Power Plant Technology","Source Power Plant Technology","Efficiency","Source Efficiency","Net Nominal Capacity\n(Active Electrical Power) [MW]",{"$f":"'Merit Order'!I11","v":"Mean Available Net Nominal Capacity [MW]"},"Fuel Price (incl. Transport) [EUR/MWhth]","Marginal Costs [EUR/MWhel]"]
[null,null,"No","(optional)","(optional)","(optional)","(optional)","(optional)","(optional)","(optional)","(optional)","(optional)","(optional)","(required)","(required)","(optional)","(optional)","(required)","(optional)","(required)",{"$f":"IF(ISNUMBER((1-VLOOKUP(O11,Start!$H$33:$I$40,2,FALSE)/100)*T11),(1-VLOOKUP(O11,Start!$H$33:$I$40,2,FALSE)/100)*T11,0)","v":0},{"$f":"IF(ISNUMBER(VLOOKUP(N11,Start!$C$9:$D$15,2,FALSE)+VLOOKUP(N11,Start!$C$23:$D$29,2,FALSE)),VLOOKUP(N11,Start!$C$9:$D$15,2,FALSE)+VLOOKUP(N11,Start!$C$23:$D$29,2,FALSE),0)","v":0},{"$f":"IF(ISNUMBER((V11/R11)+Start!$D$19*(VLOOKUP(N11,Start!$M$33:$N$39,2,FALSE)/R11)+VLOOKUP(O11,Start!$C$33:$D$40,2,FALSE)),(V11/R11)+Start!$D$19*(VLOOKUP(N11,Start!$M$33:$N$39,2,FALSE)/R11)+VLOOKUP(O11,Start!$C$33:$D$40,2,FALSE),0)","v":0}]
[null,null,"No","(optional)","(optional)","(optional)","(optional)","(optional)","(optional)","(optional)","(optional)","(optional)","(optional)","(required)","(required)","(optional)","(optional)","(required)","(optional)","(required)",{"$f":"IF(ISNUMBER((1-VLOOKUP(O12,Start!$H$33:$I$40,2,FALSE)/100)*T12),(1-VLOOKUP(O12,Start!$H$33:$I$40,2,FALSE)/100)*T12,0)","v":0},{"$f":"IF(ISNUMBER(VLOOKUP(N12,Start!$C$9:$D$15,2,FALSE)+VLOOKUP(N12,Start!$C$23:$D$29,2,FALSE)),VLOOKUP(N12,Start!$C$9:$D$15,2,FALSE)+VLOOKUP(N12,Start!$C$23:$D$29,2,FALSE),0)","v":0},{"$f":"IF(ISNUMBER((V12/R12)+Start!$D$19*(VLOOKUP(N12,Start!$M$33:$N$39,2,FALSE)/R12)+VLOOKUP(O12,Start!$C$33:$D$40,2,FALSE)),(V12/R12)+Start!$D$19*(VLOOKUP(N12,Start!$M$33:$N$39,2,FALSE)/R12)+VLOOKUP(O12,Start!$C$33:$D$40,2,FALSE),0)","v":0}]
[null,null,"No","(optional)","(optional)","(optional)","(optional)","(optional)","(optional)","(optional)","(optional)","(optional)","(optional)","(required)","(required)","(optional)","(optional)","(required)","(optional)","(required)",{"$f":"IF(ISNUMBER((1-VLOOKUP(O13,Start!$H$33:$I$40,2,FALSE)/100)*T13),(1-VLOOKUP(O13,Start!$H$33:$I$40,2,FALSE)/100)*T13,0)","v":0},{"$f":"IF(ISNUMBER(VLOOKUP(N13,Start!$C$9:$D$15,2,FALSE)+VLOOKUP(N13,Start!$C$23:$D$29,2,FALSE)),VLOOKUP(N13,Start!$C$9:$D$15,2,FALSE)+VLOOKUP(N13,Start!$C$23:$D$29,2,FALSE),0)","v":0},{"$f":"IF(ISNUMBER((V13/R13)+Start!$D$19*(VLOOKUP(N13,Start!$M$33:$N$39,2,FALSE)/R13)+VLOOKUP(O13,Start!$C$33:$D$40,2,FALSE)),(V13/R13)+Start!$D$19*(VLOOKUP(N13,Start!$M$33:$N$39,2,FALSE)/R13)+VLOOKUP(O13,Start!$C$33:$D$40,2,FALSE),0)","v":0}]
[null,null,"No","(optional)","(optional)","(optional)","(optional)","(optional)","(optional)","(optional)","(optional)","(optional)","(optional)","(required)","(required)","(optional)","(optional)","(required)","(optional)","(required)",{"$f":"IF(ISNUMBER((1-VLOOKUP(O14,Start!$H$33:$I$40,2,FALSE)/100)*T14),(1-VLOOKUP(O14,Start!$H$33:$I$40,2,FALSE)/100)*T14,0)","v":0},{"$f":"IF(ISNUMBER(VLOOKUP(N14,Start!$C$9:$D$15,2,FALSE)+VLOOKUP(N14,Start!$C$23:$D$29,2,FALSE)),VLOOKUP(N14,Start!$C$9:$D$15,2,FALSE)+VLOOKUP(N14,Start!$C$23:$D$29,2,FALSE),0)","v":0},{"$f":"IF(ISNUMBER((V14/R14)+Start!$D$19*(VLOOKUP(N14,Start!$M$33:$N$39,2,FALSE)/R14)+VLOOKUP(O14,Start!$C$33:$D$40,2,FALSE)),(V14/R14)+Start!$D$19*(VLOOKUP(N14,Start!$M$33:$N$39,2,FALSE)/R14)+VLOOKUP(O14,Start!$C$33:$D$40,2,FALSE),0)","v":0}]
[null,null,"No","(optional)","(optional)","(optional)","(optional)","(optional)","(optional)","(optional)","(optional)","(optional)","(optional)","(required)","(required)","(optional)","(optional)","(required)","(optional)","(required)",{"$f":"IF(ISNUMBER((1-VLOOKUP(O15,Start!$H$33:$I$40,2,FALSE)/100)*T15),(1-VLOOKUP(O15,Start!$H$33:$I$40,2,FALSE)/100)*T15,0)","v":0},{"$f":"IF(ISNUMBER(VLOOKUP(N15,Start!$C$9:$D$15,2,FALSE)+VLOOKUP(N15,Start!$C$23:$D$29,2,FALSE)),VLOOKUP(N15,Start!$C$9:$D$15,2,FALSE)+VLOOKUP(N15,Start!$C$23:$D$29,2,FALSE),0)","v":0},{"$f":"IF(ISNUMBER((V15/R15)+Start!$D$19*(VLOOKUP(N15,Start!$M$33:$N$39,2,FALSE)/R15)+VLOOKUP(O15,Start!$C$33:$D$40,2,FALSE)),(V15/R15)+Start!$D$19*(VLOOKUP(N15,Start!$M$33:$N$39,2,FALSE)/R15)+VLOOKUP(O15,Start!$C$33:$D$40,2,FALSE),0)","v":0}]
{"$rows_left_out":541}
{"sheet":"Sources","index":4,"n_rows":16,"n_cols":4,"rows_kept":16,"cut":false,"hidden":false,"merged":[]}
[]
[]
[null,null," EWI Merit Order Tool 2021"]
[]
[null,null," Sources",{"$f":"Imprint!F5","v":"Version 2021.4_en "}]
[]
[null,null,"Abbrevation","Sources"]
[null,null,"BNetzA (2020)","Bundesnetzagentur; Kraftwerksliste der Bundesnetzagentur as of 01.04.2020. Licensed under \"dl-en/by-2-0\": www.govdata.de/dl-de/by-2-0; URL: https://www.bundesnetzagentur.de/DE/Sachgebiete/ElektrizitaetundGas/Unternehmen_Institutionen/Versorgungssicherheit/\nErzeugungskapazitaeten/Kraftwerksliste/kraftwerksliste-node.html (accessed on 17.12.2020)"]
[null,null,"DIW (2014)","Jonas Egerer & Clemens Gerbaulet & Richard Ihlenburg & Friedrich Kunz & Benjamin Reinhard & Christian von Hirschhausen & Alexander Weber & Jens Weibezahn, 2014. \"Electricity Sector Data for Policy-Relevant Modeling: Data Documentation and Applications to the German and European Electricity Markets,\" Data Documentation 72, DIW Berlin, German Institute for Economic Research."]
[null,null,"ENTSO-E (2020)","ENTSO-E; Transparency Platform, URL: https://transparency.entsoe.eu/ (accessed on  28.12.2020)"]
[null,null,"EWI (2019)","Energiewirtschaftliches Institut an der Universität zu Köln gGmbH; Auswirkungen einer Beendigung der Kohleverstromung bis 2038 auf den Strommarkt, CO2-Emissionen und ausgewählte Industrien - Eine Analyse des Abschlussberichts der WSB-Kommission, August 2019."]
[null,null,"OPSD (2018)","Open Power System Data. 2018. Data Package Conventional power plants. Version 2018-12-20."]
[null,null,"R2B (2019)","R2b energy consulting GmbH, Consentec GmbH, Fraunhofer ISI, TEP Energy GmbH; Definition und Monitoring der Versorgungssicherheit an den europäischen Strommärkten, Projekt Nr. 047/16, Januar 2019."]
[null,null,"Sandbag (2020)","Sandbag; Carbon Price Viewer, URL: https://sandbag.org.uk/carbon-price-viewer/ (accessed on  05.01.2021)"]
[null,null,"SDKW (2020)","Statistik der Kohlewirtschaft e.V.; Entwicklung ausgewählter Energiepreise, Stand 22.12.2020.\n(Assumed value of November 2020 for December 2020)"]
{"$rows_left_out":2}
{"sheet":"Imprint","index":5,"n_rows":29,"n_cols":6,"rows_kept":29,"cut":false,"hidden":false,"merged":[[12,4,12,5],[18,4,18,5],[13,4,13,5],[22,4,22,5]]}
[]
[]
[null,null," EWI Merit Order Tool 2021"]
[]
[null,null," Imprint",null,null,{"$f":"CONCATENATE(\"Version \",F11,\" \")","v":"Version 2021.4_en "}]
[]
[]
[null,null,null,"EWI Merit Order Tool 2021"]
[]
[null,null," ","Institute of Energy Economics at the University of Cologne (EWI)","Last updated:","28.10.2021"]
[null,null,null,"Alte Wagenfabrik","Model version:","2021.4_en"]
[null,null,null,"Vogelsanger Straße 321a"]
[null,null,null,"50827 Köln"]
[null,null,null,"Tel.: +49 (0)221 277 29-100"]
[null,null,null,"Fax:  +49 (0)221 277 29-400"]
{"$rows_left_out":15}
{"sheet":"Start Reset","index":6,"n_rows":40,"n_cols":16,"rows_kept":40,"cut":false,"hidden":true,"merged":[[30,2,30,5],[30,7,30,10],[30,12,30,15],[6,2,6,5],[6,7,6,15],[7,7,10,13],[16,2,16,5],[20,2,20,5]]}
[]
[]
[null,null," EWI Merit Order Tool 2021"]
[]
[null,null," Start",null,null,null,null,null,null,null,null,null,null,null,null,{"$f":"Imprint!F5","v":"Version 2021.4_en "}]
[]
[null,null,{"$f":"Start!C7","v":"Fuel Prices"},null,null,null,null,"Übersicht über die Grenzkosten der Kraftwerke"]
[null,null,{"$f":"Start!C8","v":"Fuel Type"},{"$f":"Start!D8","v":"Price"},{"$f":"Start!E8","v":"Unit"},{"$f":"Start!F8","v":"Source"},null,{"$f":"Start!H8","v":"The boxplot diagram gives a first overview of the marginal cost distribution of power plants. In the illustration to the right of this text box, the individual elements of the diagram are explained. Changes in assumptions are reflected in the diagram immediately. In order to transfer the assumptions to the merit order in the Merit Order sheet, the button Update Merit Order must be clicked."}]
[null,null,{"$f":"Start!C9","v":"Nuclear"},5.5,"EUR/MWhth","refer to documentation"]
[null,null,{"$f":"Start!C10","v":"Lignite"},3.1,"EUR/MWhth","EWI (2019)"]
[null,null,{"$f":"Start!C11","v":"Coal"},6.25,"EUR/MWhth","VDKi (2020)"]
[null,null,{"$f":"Start!C12","v":"Gas"},10.17,"EUR/MWhth","Spot TTF"]
[null,null,{"$f":"Start!C13","v":"Oil"},22.9,"EUR/MWhth","SDKW (2019)"]
[null,null,{"$f":"Start!C14","v":"Waste"},0,"EUR/MWhth","refer to documentation"]
[null,null,{"$f":"Start!C15","v":"Other"},22.9,"EUR/MWhth","refer to documentation"]
{"$rows_left_out":26}
{"sheet":"Backend I","index":7,"n_rows":536,"n_cols":5,"rows_kept":536,"cut":false,"hidden":true,"merged":[]}
["Index","Power Plant Type","Performance","cumulated performance","marginal costs"]
["BNA0084","Waste",30.599999999999998,30.599999999999998,1]
["BNA0088b","Waste",29.75,60.349999999999994,1]
["BNA0097","Waste",28.9,89.25,1]
["BNA0117a","Waste",10.199999999999999,99.45,1]
["BNA0139","Waste",28.05,127.5,1]
["BNA0223b","Waste",45.645000000000003,173.14500000000001,1]
["BNA0237","Waste",19.974999999999998,193.12,1]
["BNA0287a","Waste",22.099999999999998,215.22,1]
["BNA0287b","Waste",39.524999999999999,254.745,1]
["BNA0380","Waste",19.805,274.55,1]
["BNA0398","Waste",20.399999999999999,294.95,1]
["BNA0407","Waste",11.219999999999999,306.16999999999996,1]
["BNA0417","Waste",19.125,325.29499999999996,1]
["BNA0438","Waste",31.875,357.16999999999996,1]
{"$rows_left_out":522}
{"sheet":"Backend II","index":8,"n_rows":1004,"n_cols":10,"rows_kept":1004,"cut":false,"hidden":true,"merged":[]}
["Power","Renewables","Waste","Nuclear","Lignite","Coal","CCGT","OCGT","Oil","Other"]
[0,0,1,0,0,0,0,0,0,0]
[1581.5359250000001,0,1,0,0,0,0,0,0,0]
[1581.5359250000001,0,0,17.866700000000002,0,0,0,0,0,0]
[9127.5559250000006,0,0,17.866700000000002,0,0,0,0,0,0]
[9127.5559250000006,0,0,0,0,0,27.066600000000001,0,0,0]
[10099.780925000001,0,0,0,0,0,27.066600000000001,0,0,0]
[10099.780925000001,0,0,0,0,0,27.256,0,0,0]
[10323.370925000001,0,0,0,0,0,27.256,0,0,0]
[10323.370925000001,0,0,0,0,0,27.4482,0,0,0]
[10357.561925,0,0,0,0,0,27.4482,0,0,0]
[10357.561925,0,0,0,0,0,27.6433,0,0,0]
[11045.331725,0,0,0,0,0,27.6433,0,0,0]
[11045.331725,0,0,0,0,0,28.042400000000001,0,0,0]
[11113.191725000001,0,0,0,0,0,28.042400000000001,0,0,0]
{"$rows_left_out":990}
{"sheet":"Power Plant List Backend","index":9,"n_rows":555,"n_cols":12,"rows_kept":555,"cut":false,"hidden":true,"merged":[]}
[]
[]
[null,null," EWI Merit-Order Tool 2021"]
[]
[null,null,"Power-Plant List",null,null,null,null,null,null,null,null,{"$f":"Imprint!F5","v":"Version 2021.4_en "}]
[]
[null,null,"Brief explanation of the list and basic data sources"]
[]
[]
[null,null,{"$f":"'Power Plant List'!C10","v":"Included in the Merit Order?"},{"$f":"'Power Plant List'!D10","v":"Power Plant Identification Number of the Federal Network Agency"},{"$f":"'Power Plant List'!E10","v":"Company"},{"$f":"'Power Plant List'!F10","v":"Name of the Power Plant"},{"$f":"'Power Plant List'!K10","v":"Unit Name"},{"$f":"'Power Plant List'!L10","v":"Begin of Commercial Electricity Generation"},"Assigned Power Plant Type","Efficiency",{"$f":"'Power Plant List'!U10","v":"Mean Available Net Nominal Capacity [MW]"},{"$f":"'Power Plant List'!W10","v":"Marginal Costs [EUR/MWhel]"}]
[null,null,"No","(optional)","(optional)","(optional)","(optional)","(optional)","(required)","(required)",0,0]
[null,null,"No","(optional)","(optional)","(optional)","(optional)","(optional)","(required)","(required)",0,0]
[null,null,"No","(optional)","(optional)","(optional)","(optional)","(optional)","(required)","(required)",0,0]
[null,null,"No","(optional)","(optional)","(optional)","(optional)","(optional)","(required)","(required)",0,0]
[null,null,"No","(optional)","(optional)","(optional)","(optional)","(optional)","(required)","(required)",0,0]
{"$rows_left_out":541}
{"sheet":"Hilfssheet Abbildung","index":10,"n_rows":26,"n_cols":9,"rows_kept":26,"cut":false,"hidden":true,"merged":[]}
[]
[null,null,"Waste","Nuclear","Lignite","Coal","CCGT","OCGT","Oil"]
[null,"Minimalwert",{"$f":"MIN(IF('Power Plant List'!$O$11:$O$555='Hilfssheet Abbildung'!C2,'Power Plant List'!$W$11:$W$555,\"fail\"))","v":1},{"$f":"MIN(IF('Power Plant List'!$O$11:$O$555='Hilfssheet Abbildung'!D2,'Power Plant List'!$W$11:$W$555,\"fail\"))","v":17.866666666666664},{"$f":"MIN(IF('Power Plant List'!$O$11:$O$555='Hilfssheet Abbildung'!E2,'Power Plant List'!$W$11:$W$555,\"fail\"))","v":31.919188191881918},{"$f":"MIN(IF('Power Plant List'!$O$11:$O$555='Hilfssheet Abbildung'!F2,'Power Plant List'!$W$11:$W$555,\"fail\"))","v":32.73674603174603},{"$f":"MIN(IF('Power Plant List'!$O$11:$O$555='Hilfssheet Abbildung'!G2,'Power Plant List'!$W$11:$W$555,\"fail\"))","v":27.066601307189543},{"$f":"MIN(IF('Power Plant List'!$O$11:$O$555='Hilfssheet Abbildung'!H2,'Power Plant List'!$W$11:$W$555,\"fail\"))","v":38.576272814601346},{"$f":"MIN(IF('Power Plant List'!$O$11:$O$555='Hilfssheet Abbildung'!I2,'Power Plant List'!$W$11:$W$555,\"fail\"))","v":76.882145555275741}]
[null,"erstes Quartil",{"$f":"_xlfn.QUARTILE.INC(IF('Power Plant List'!$O$11:$O$555='Hilfssheet Abbildung'!C2,'Power Plant List'!$W$11:$W$555,\"fail\"),1)","v":1},{"$f":"_xlfn.QUARTILE.INC(IF('Power Plant List'!$O$11:$O$555='Hilfssheet Abbildung'!D2,'Power Plant List'!$W$11:$W$555,\"fail\"),1)","v":17.866666666666664},{"$f":"_xlfn.QUARTILE.INC(IF('Power Plant List'!$O$11:$O$555='Hilfssheet Abbildung'!E2,'Power Plant List'!$W$11:$W$555,\"fail\"),1)","v":34.556465995975856},{"$f":"_xlfn.QUARTILE.INC(IF('Power Plant List'!$O$11:$O$555='Hilfssheet Abbildung'!F2,'Power Plant List'!$W$11:$W$555,\"fail\"),1)","v":36.607505152079455},{"$f":"_xlfn.QUARTILE.INC(IF('Power Plant List'!$O$11:$O$555='Hilfssheet Abbildung'!G2,'Power Plant List'!$W$11:$W$555,\"fail\"),1)","v":31.735285024154592},{"$f":"_xlfn.QUARTILE.INC(IF('Power Plant List'!$O$11:$O$555='Hilfssheet Abbildung'!H2,'Power Plant List'!$W$11:$W$555,\"fail\"),1)","v":42.459353471118177},{"$f":"_xlfn.QUARTILE.INC(IF('Power Plant List'!$O$11:$O$555='Hilfssheet Abbildung'!I2,'Power Plant List'!$W$11:$W$555,\"fail\"),1)","v":80.401317523056662}]
[null,"Median",{"$f":"_xlfn.QUARTILE.INC(IF('Power Plant List'!$O$11:$O$555='Hilfssheet Abbildung'!C2,'Power Plant List'!$W$11:$W$555,\"fail\"),2)","v":1},{"$f":"_xlfn.QUARTILE.INC(IF('Power Plant List'!$O$11:$O$555='Hilfssheet Abbildung'!D2,'Power Plant List'!$W$11:$W$555,\"fail\"),2)","v":17.866666666666664},{"$f":"_xlfn.QUARTILE.INC(IF('Power Plant List'!$O$11:$O$555='Hilfssheet Abbildung'!E2,'Power Plant List'!$W$11:$W$555,\"fail\"),2)","v":35.680912863070546},{"$f":"_xlfn.QUARTILE.INC(IF('Power Plant List'!$O$11:$O$555='Hilfssheet Abbildung'!F2,'Power Plant List'!$W$11:$W$555,\"fail\"),2)","v":40.42128395061728},{"$f":"_xlfn.QUARTILE.INC(IF('Power Plant List'!$O$11:$O$555='Hilfssheet Abbildung'!G2,'Power Plant List'!$W$11:$W$555,\"fail\"),2)","v":40.25838493931137},{"$f":"_xlfn.QUARTILE.INC(IF('Power Plant List'!$O$11:$O$555='Hilfssheet Abbildung'!H2,'Power Plant List'!$W$11:$W$555,\"fail\"),2)","v":44.560022271714928},{"$f":"_xlfn.QUARTILE.INC(IF('Power Plant List'!$O$11:$O$555='Hilfssheet Abbildung'!I2,'Power Plant List'!$W$11:$W$555,\"fail\"),2)","v":84.772032249096469}]
[null,"Drittes Quartil",{"$f":"_xlfn.QUARTILE.INC(IF('Power Plant List'!$O$11:$O$555='Hilfssheet Abbildung'!C2,'Power Plant List'!$W$11:$W$555,\"fail\"),3)","v":1},{"$f":"_xlfn.QUARTILE.INC(IF('Power Plant List'!$O$11:$O$555='Hilfssheet Abbildung'!D2,'Power Plant List'!$W$11:$W$555,\"fail\"),3)","v":17.866666666666664},{"$f":"_xlfn.QUARTILE.INC(IF('Power Plant List'!$O$11:$O$555='Hilfssheet Abbildung'!E2,'Power Plant List'!$W$11:$W$555,\"fail\"),3)","v":40.238352941176473},{"$f":"_xlfn.QUARTILE.INC(IF('Power Plant List'!$O$11:$O$555='Hilfssheet Abbildung'!F2,'Power Plant List'!$W$11:$W$555,\"fail\"),3)","v":42.320805027230833},{"$f":"_xlfn.QUARTILE.INC(IF('Power Plant List'!$O$11:$O$555='Hilfssheet Abbildung'!G2,'Power Plant List'!$W$11:$W$555,\"fail\"),3)","v":42.492297615928749},{"$f":"_xlfn.QUARTILE.INC(IF('Power Plant List'!$O$11:$O$555='Hilfssheet Abbildung'!H2,'Power Plant List'!$W$11:$W$555,\"fail\"),3)","v":51.506003873466753},{"$f":"_xlfn.QUARTILE.INC(IF('Power Plant List'!$O$11:$O$555='Hilfssheet Abbildung'!I2,'Power Plant List'!$W$11:$W$555,\"fail\"),3)","v":92.145795523290985}]
[null,"Maximalwert",{"$f":"MAX(IF('Power Plant List'!$O$11:$O$555='Hilfssheet Abbildung'!C2,'Power Plant List'!$W$11:$W$555,\"fail\"))","v":1},{"$f":"MAX(IF('Power Plant List'!$O$11:$O$555='Hilfssheet Abbildung'!D2,'Power Plant List'!$W$11:$W$555,\"fail\"))","v":17.866666666666664},{"$f":"MAX(IF('Power Plant List'!$O$11:$O$555='Hilfssheet Abbildung'!E2,'Power Plant List'!$W$11:$W$555,\"fail\"))","v":66.954183266932276},{"$f":"MAX(IF('Power Plant List'!$O$11:$O$555='Hilfssheet Abbildung'!F2,'Power Plant List'!$W$11:$W$555,\"fail\"))","v":69.44675268817204},{"$f":"MAX(IF('Power Plant List'!$O$11:$O$555='Hilfssheet Abbildung'!G2,'Power Plant List'!$W$11:$W$555,\"fail\"))","v":88.426444444444456},{"$f":"MAX(IF('Power Plant List'!$O$11:$O$555='Hilfssheet Abbildung'!H2,'Power Plant List'!$W$11:$W$555,\"fail\"))","v":57.69115942028985},{"$f":"MAX(IF('Power Plant List'!$O$11:$O$555='Hilfssheet Abbildung'!I2,'Power Plant List'!$W$11:$W$555,\"fail\"))","v":99.925804333552207}]
[]
[]
[null,null,"Waste","Nuclear","Lignite","Coal","CCGT","OCGT","Oil"]
[null,"Q1-Minimum",null,null,{"$f":"E4-E3","v":2.6372778040939373},{"$f":"F4-F3","v":3.8707591203334246},{"$f":"G4-G3","v":4.6686837169650488},{"$f":"H4-H3","v":3.8830806565168317},{"$f":"I4-I3","v":3.5191719677809203}]
[null,"Q1",{"$f":"C4","v":1},17.866666666666664,34.556465995975856,36.607505152079455,31.735285024154592,42.459353471118177,80.401317523056662]
[null,"Median-Q1",{"$f":"C5-C4+0.1","v":0.1},{"$f":"D5-D4+0.1","v":0.1},{"$f":"E5-E4","v":1.1244468670946901},3.8137787985378253,8.5230999151567772,2.1006688005967504,4.3707147260398074]
[null,"Q3-Median",{"$f":"C6-C5+0.1","v":0.1},{"$f":"D6-D5+0.1","v":0.1},4.5574400781059268,1.8995210766135529,2.2339126766173791,6.945981601751825,7.3737632741945163]
[null,"Maximum-Q3",null,null,26.715830325755803,27.125947660941208,45.934146828515708,6.185155546823097,7.7800088102612222]
{"$rows_left_out":11}