{"text_format":"1","workbook":"xlsx","n_sheets":11,"sheets":["Anleitung","Start","Merit-Order","Kraftwerksliste","Quellen","Impressum","Start Reset","Backend I","Backend II","Kraftwerksliste Backend","Hilfssheet Abbildung"],"not_rendered":{"charts":4,"images":5,"macros":1,"external_links":0,"defined_names":3,"comments":0,"pivot_tables":0},"unopened":[],"bounds":{"document_bytes":16777216,"sheet_cells":100000,"rows_first":2000,"rows_last":500,"rows_between":2000,"halvings":0,"cell_chars":16384,"cell_head_chars":4096},"cells_cut":0,"cells_raw":0,"read":"whole","date_system":"1900"}

{"sheet":"Anleitung","index":0,"n_rows":32,"n_cols":5,"rows_kept":32,"cut":false,"hidden":false,"merged":[]}
[]
[]
[null,null," EWI Merit-Order Tool 2020"]
[]
[null,null," Kurzanleitung",null,{"$f":"Impressum!F5","v":"Version 2020.1.1 "}]
[]
[]
[null,null,null,"Um alle Funktionen des EWI Merit-Order Tools 2020 nutzen zu können, müssen Makros aktiviert werden."]
[]
[null,null,null,"Die Merit-Order"]
[null,null,null,"Als Merit-Order wird die Einsatzreihenfolge der an der Strombörse anbietenden Kraftwerke bezeichnet. Sie orientiert sich an den Grenzkosten der Kraftwerke, diese werden aufsteigend sortiert. Es handelt sich dabei um eine Annäherung an die tatsächlichen Angebotskurven bspw. der Day-Ahead-Auktion an der Strombörse. Die jährlich mittlere Merit-Order des deutschen Kraftwerksparks gibt einen guten Überblick über die Verhältnisse der Grenzkosten der Kraftwerke entsprechend aktueller Bedingungen. Die Merit-Order wird dabei insbesondere vom Kraftwerkspark und den zugrundeliegenden Brennstoffpreisen und Emissionszertifikatspreisen beeinflusst."]
[null,null,null," "]
[null,null,null,"Das EWI Merit-Order Tool 2020"]
[null,null,null,"Das EWI Merit-Order Tool 2020 ermöglicht die Ermittlung und grafische Repräsentation der jährlichen mittleren Merit-Order basierend auf dem konventionellen Kraftwerkspark 2019. Benutzer*innen können die der Merit-Order zugrundeliegenden Annahmen variieren, um den Effekt veränderter Brennstoffpreise oder anderer Annahmen auf die Merit-Order zu untersuchen. Zusätzlich besteht die Möglichkeit, Kraftwerke aus der Merit-Order zu entfernen oder hinzuzufügen. Nutzer*innen können also auch den Einfluss von Kraftwerksstilllegungen oder -zubauten auf die Merit-Order analysieren und visualisieren. Als Standardeinstellung wird nur die Merit-Order der konventionellen Kraftwerke ausgegeben. Um die Merit-Order in Abhängigkeit konkreter Einspeisesituationen erneuerbarer-Energien-Anlagen (EE-Anlagen) abzubilden, kann außerdem eine Annahme zur verfügbaren EE-Leistung getroffen werden."]
[]
{"$rows_left_out":18}
{"sheet":"Start","index":1,"n_rows":40,"n_cols":16,"rows_kept":40,"cut":false,"hidden":false,"merged":[[9,7,9,13],[10,7,10,13],[6,2,6,5],[20,2,20,5],[30,7,30,10],[30,12,30,15],[16,2,16,5],[30,2,30,5],[6,7,6,15],[7,7,7,13],[8,7,8,13]]}
[]
[]
[null,null," EWI Merit-Order Tool 2020"]
[]
[null,null," Start",null,null,null,null,null,null,null,null,null,null,null,null,{"$f":"Impressum!F5","v":"Version 2020.1.1 "}]
[]
[null,null,"Brennstoffkosten",null,null,null,null,"Übersicht über die Grenzkosten der Kraftwerke"]
[null,null,"Brennstoff","Kosten","Einheit","Quelle",null,"   Das Boxplot-Diagramm gibt einen ersten Überblick über die Grenzkosten der Kraftwerke. In der Abbildung rechts"]
[null,null,"Kernenergie",5.5,"EUR/MWhth","siehe Dokumentation",null,"   werden die einzelnen Elemente des Diagramms erläutert. Veränderungen der Annahmen gibt das Diagramm"]
[null,null,"Braunkohle",3.1,"EUR/MWhth","EWI (2019)",null,"   augenblicklich wieder. Um die Annahmen in die Merit-Order (Tabellenblatt: Merit-Order) zu übernehmen, muss die"]
[null,null,"Steinkohle",7.92,"EUR/MWhth","VDKi (2020)",null,"   Schaltfläche Aktualisiere Merit-Order aktiviert werden."]
[null,null,"Erdgas",13.57,"EUR/MWhth","Spot TTF"]
[null,null,"Öl",33.14,"EUR/MWhth","SDKW (2019)"]
[null,null,"Abfall",0,"EUR/MWhth","siehe Dokumentation"]
[null,null,"Sonstige",33.14,"EUR/MWhth","siehe Dokumentation"]
{"$rows_left_out":26}
{"sheet":"Merit-Order","index":2,"n_rows":544,"n_cols":11,"rows_kept":544,"cut":false,"hidden":false,"merged":[[9,2,9,10],[6,2,6,10]]}
[]
[]
[null,null," EWI Merit-Order Tool 2020"]
[]
[null,null," Merit-Order",null,null,null,null,null,null,null,{"$f":"Impressum!F5","v":"Version 2020.1.1 "}]
[]
[null,null,"Grafische Darstellung der Merit-Order"]
[]
[]
[null,null,"Merit-Order in tabellarischer Form"]
[null,null,"Kraftwerksnummer der Bundesnetzagentur","Unternehmen","Kraftwerksname","Blockname","Aufnahme der kommerziellen Stromerzeugung","Kraftwerkstyp","Durchschnittliche verfügbare Nettonennleistung [MW]","Kumulierte verfügbare Nettonennleistung [MW]","Grenzkosten [EUR/MWhel]"]
[null,null,"BNA0084","Vattenfall Wärme Berlin AG","Reuter","Reuter M","30.10.1998","Abfall",30.599999999999998,30.599999999999998,1]
[null,null,"BNA0088b","Solvay Chemicals GmbH","Dampfturbinenanlage der EBS-Kessel",null,"16.10.2009","Abfall",29.75,60.349999999999994,1]
[null,null,"BNA0097","MVA Bielefeld-Herford GmbH","MVA Bielefeld","Linien 1 - 3","01.07.1981","Abfall",28.9,89.25,1]
[null,null,"BNA0117a","Energie- und Wasserversorgung Bonn/Rhein-Sieg GmbH","Heizkraftwerk Karlstraße","Heizkraftwerk Karlstraße","01.07.1990","Abfall",10.199999999999999,99.45,1]
{"$rows_left_out":530}
{"sheet":"Kraftwerksliste","index":3,"n_rows":553,"n_cols":26,"rows_kept":553,"cut":false,"hidden":false,"merged":[[6,2,6,10]]}
[]
[]
[null,null," EWI Merit-Order Tool 2020"]
[]
[null,null," Kraftwerksliste",null,null,null,null,null,null,null,null,null,null,null,null,null,null,null,null,null,null,null,null,null,null,{"$f":"Impressum!F5","v":"Version 2020.1.1 "}]
[]
[null,null," Die Kraftwerksliste basiert auf der Kraftwerksliste der Bundesnetzagentur (BNetzA, 2019b). In die Kraftwerksliste eingegangen sind alle konventionellen Kraftwerke, die am \n 11.11.2019 in Betrieb waren. Die in dunkelgelb eingefärben Spalten sind unverändert aus BNetzA (2019b) übernommen. Die hellgelben Spalten enthalten zusätzliche Informationen,\n basierend auf eigenen Annahmen, Berechnungen und weiteren Quellen. Die Annahmen zur Effizienz der Kraftwerke sind beispielsweise größtenteils aus OPSD (2018) entnommen.\n Die weiß hinterlegten Felder können von den Nutzer*innen angepasst werden. So können Kraftwerke aus der Merit-Order entfernt und bis zu 10 neue Kraftwerke hinzugefügt werden."]
[]
[]
[null,null,"Teil der Merit-Order?","Kraftwerksnummer Bundesnetzagentur","Unternehmen","Kraftwerksname","PLZ\n(Standort Kraftwerk)","Ort\n(Standort Kraftwerk)","Straße und Hausnummer\n(Standort Kraftwerk)","Bundesland","Blockname","Aufnahme der kommerziellen Stromerzeugung ","Energieträger (BNetzA, 2019)","Spezifizierung \"Mehrere Energieträger\" und \"Sonstige Energieträger\" - Hauptbrennstoff","Spezifizierung \"Mehrere Energieträger\" - Zusatz- / Ersatzbrennstoffe","Auswertung\nEnergieträger (Zuordnung zu einem Hauptenergieträger bei Mehreren Energieträgern)","Angenommener Hauptenergieträger ","Zuordnung Kraftwerkstyp","Kraftwerkstechnologie","Quelle Kraftwerkstechnologie","Effizienz","Quelle Effizienz","Netto-Nennleistung\n(elektrische Wirkleistung) [MW]","Mittlere verfügbare\nNetto-Nennleistung [MW]","Brennstoffkosten (inkl. Transport) [EUR/MWHth]","Grenzkosten [EUR/MWHel]"]
[null,null,"Nein","(optional)","(optional)","(optional)","(optional)","(optional)","(optional)","(optional)","(optional)","(optional)","(optional)",null,null,null,"(notwendig)","(notwendig)","(optional)","(optional)","(notwendig)","(optional)","(notwendig)",{"$f":"IF(ISNUMBER((1-VLOOKUP(R11,Start!$H$33:$I$40,2,FALSE)/100)*W11),(1-VLOOKUP(R11,Start!$H$33:$I$40,2,FALSE)/100)*W11,0)","v":0},{"$f":"IF(ISNUMBER(VLOOKUP(Q11,Start!$C$9:$D$15,2,FALSE)+VLOOKUP(Q11,Start!$C$23:$D$29,2,FALSE)),VLOOKUP(Q11,Start!$C$9:$D$15,2,FALSE)+VLOOKUP(Q11,Start!$C$23:$D$29,2,FALSE),0)","v":0},{"$f":"IF(ISNUMBER((Y11/U11)+Start!$D$19*(VLOOKUP(Q11,Start!$M$33:$N$39,2,FALSE)/U11)+VLOOKUP(R11,Start!$C$33:$D$40,2,FALSE)),(Y11/U11)+Start!$D$19*(VLOOKUP(Q11,Start!$M$33:$N$39,2,FALSE)/U11)+VLOOKUP(R11,Start!$C$33:$D$40,2,FALSE),0)","v":0}]
[null,null,"Nein","(optional)","(optional)","(optional)","(optional)","(optional)","(optional)","(optional)","(optional)","(optional)","(optional)",null,null,null,"(notwendig)","(notwendig)","(optional)","(optional)","(notwendig)","(optional)","(notwendig)",{"$f":"IF(ISNUMBER((1-VLOOKUP(R12,Start!$H$33:$I$40,2,FALSE)/100)*W12),(1-VLOOKUP(R12,Start!$H$33:$I$40,2,FALSE)/100)*W12,0)","v":0},{"$f":"IF(ISNUMBER(VLOOKUP(Q12,Start!$C$9:$D$15,2,FALSE)+VLOOKUP(Q12,Start!$C$23:$D$29,2,FALSE)),VLOOKUP(Q12,Start!$C$9:$D$15,2,FALSE)+VLOOKUP(Q12,Start!$C$23:$D$29,2,FALSE),0)","v":0},{"$f":"IF(ISNUMBER((Y12/U12)+Start!$D$19*(VLOOKUP(Q12,Start!$M$33:$N$39,2,FALSE)/U12)+VLOOKUP(R12,Start!$C$33:$D$40,2,FALSE)),(Y12/U12)+Start!$D$19*(VLOOKUP(Q12,Start!$M$33:$N$39,2,FALSE)/U12)+VLOOKUP(R12,Start!$C$33:$D$40,2,FALSE),0)","v":0}]
[null,null,"Nein","(optional)","(optional)","(optional)","(optional)","(optional)","(optional)","(optional)","(optional)","(optional)","(optional)",null,null,null,"(notwendig)","(notwendig)","(optional)","(optional)","(notwendig)","(optional)","(notwendig)",{"$f":"IF(ISNUMBER((1-VLOOKUP(R13,Start!$H$33:$I$40,2,FALSE)/100)*W13),(1-VLOOKUP(R13,Start!$H$33:$I$40,2,FALSE)/100)*W13,0)","v":0},{"$f":"IF(ISNUMBER(VLOOKUP(Q13,Start!$C$9:$D$15,2,FALSE)+VLOOKUP(Q13,Start!$C$23:$D$29,2,FALSE)),VLOOKUP(Q13,Start!$C$9:$D$15,2,FALSE)+VLOOKUP(Q13,Start!$C$23:$D$29,2,FALSE),0)","v":0},{"$f":"IF(ISNUMBER((Y13/U13)+Start!$D$19*(VLOOKUP(Q13,Start!$M$33:$N$39,2,FALSE)/U13)+VLOOKUP(R13,Start!$C$33:$D$40,2,FALSE)),(Y13/U13)+Start!$D$19*(VLOOKUP(Q13,Start!$M$33:$N$39,2,FALSE)/U13)+VLOOKUP(R13,Start!$C$33:$D$40,2,FALSE),0)","v":0}]
[null,null,"Nein","(optional)","(optional)","(optional)","(optional)","(optional)","(optional)","(optional)","(optional)","(optional)","(optional)",null,null,null,"(notwendig)","(notwendig)","(optional)","(optional)","(notwendig)","(optional)","(notwendig)",{"$f":"IF(ISNUMBER((1-VLOOKUP(R14,Start!$H$33:$I$40,2,FALSE)/100)*W14),(1-VLOOKUP(R14,Start!$H$33:$I$40,2,FALSE)/100)*W14,0)","v":0},{"$f":"IF(ISNUMBER(VLOOKUP(Q14,Start!$C$9:$D$15,2,FALSE)+VLOOKUP(Q14,Start!$C$23:$D$29,2,FALSE)),VLOOKUP(Q14,Start!$C$9:$D$15,2,FALSE)+VLOOKUP(Q14,Start!$C$23:$D$29,2,FALSE),0)","v":0},{"$f":"IF(ISNUMBER((Y14/U14)+Start!$D$19*(VLOOKUP(Q14,Start!$M$33:$N$39,2,FALSE)/U14)+VLOOKUP(R14,Start!$C$33:$D$40,2,FALSE)),(Y14/U14)+Start!$D$19*(VLOOKUP(Q14,Start!$M$33:$N$39,2,FALSE)/U14)+VLOOKUP(R14,Start!$C$33:$D$40,2,FALSE),0)","v":0}]
[null,null,"Nein","(optional)","(optional)","(optional)","(optional)","(optional)","(optional)","(optional)","(optional)","(optional)","(optional)",null,null,null,"(notwendig)","(notwendig)","(optional)","(optional)","(notwendig)","(optional)","(notwendig)",{"$f":"IF(ISNUMBER((1-VLOOKUP(R15,Start!$H$33:$I$40,2,FALSE)/100)*W15),(1-VLOOKUP(R15,Start!$H$33:$I$40,2,FALSE)/100)*W15,0)","v":0},{"$f":"IF(ISNUMBER(VLOOKUP(Q15,Start!$C$9:$D$15,2,FALSE)+VLOOKUP(Q15,Start!$C$23:$D$29,2,FALSE)),VLOOKUP(Q15,Start!$C$9:$D$15,2,FALSE)+VLOOKUP(Q15,Start!$C$23:$D$29,2,FALSE),0)","v":0},{"$f":"IF(ISNUMBER((Y15/U15)+Start!$D$19*(VLOOKUP(Q15,Start!$M$33:$N$39,2,FALSE)/U15)+VLOOKUP(R15,Start!$C$33:$D$40,2,FALSE)),(Y15/U15)+Start!$D$19*(VLOOKUP(Q15,Start!$M$33:$N$39,2,FALSE)/U15)+VLOOKUP(R15,Start!$C$33:$D$40,2,FALSE),0)","v":0}]
{"$rows_left_out":539}
{"sheet":"Quellen","index":4,"n_rows":17,"n_cols":4,"rows_kept":17,"cut":false,"hidden":false,"merged":[]}
[]
[]
[null,null," EWI Merit-Order Tool 2020"]
[]
[null,null," Quellen",{"$f":"Impressum!F5","v":"Version 2020.1.1 "}]
[]
[null,null,"Abkürzung","Quelle"]
[null,null,"BNetzA (2019b)","Bundesnetzagentur; Kraftwerksliste der Bundesnetzagentur, Stand: 11.11.2019. Lizensiert unter \"dl-de/by-2-0\": www.govdata.de/dl-de/by-2-0; URL: https://www.bundesnetzagentur.de/DE/Sachgebiete/ElektrizitaetundGas/Unternehmen_Institutionen/Versorgungssicherheit/Erzeugungskapazitaeten/Kraftwerksliste/kraftwerksliste-node.html (abgerufen am 03.01.2020)"]
[null,null,"DIW (2014)","Jonas Egerer & Clemens Gerbaulet & Richard Ihlenburg & Friedrich Kunz & Benjamin Reinhard & Christian von Hirschhausen & Alexander Weber & Jens Weibezahn, 2014. \"Electricity Sector Data for Policy-Relevant Modeling: Data Documentation and Applications to the German and European Electricity Markets,\" Data Documentation 72, DIW Berlin, German Institute for Economic Research."]
[null,null,"ENTSO-E (2020)","ENTSO-E; Transparency Platform, URL: https://transparency.entsoe.eu/ (abgerufen am: 07.01.2020)"]
[null,null,"EWI (2019)","Energiewirtschaftliches Institut an der Universität zu Köln gGmbH; Auswirkungen einer Beendigung der Kohleverstromung bis 2038 auf den Strommarkt, CO2-Emissionen und ausgewählte Industrien - Eine Analyse des Abschlussberichts der WSB-Kommission, August 2019."]
[null,null,"OPSD (2018)","Open Power System Data. 2018. Data Package Conventional power plants. Version 2018-12-20."]
[null,null,"R2B (2019)","R2b energy consulting GmbH, Consentec GmbH, Fraunhofer ISI, TEP Energy GmbH; Definition und Monitoring der Versorgungssicherheit an den europäischen Strommärkten, Projekt Nr. 047/16, Januar 2019."]
[null,null,"Sandbag (2020)","Sandbag; Carbon Price Viewer, URL: https://sandbag.org.uk/carbon-price-viewer/ (abgerufen am: 03.01.2020)"]
[null,null,"SDKW (2019)","Statistik der Kohlewirtschaft e.V.; Entwicklung ausgewählter Energiepreise, Stand 19.12.2019.\n(Für Dezember 2019 Annahme des Wertes aus dem November 2019)"]
{"$rows_left_out":3}
{"sheet":"Impressum","index":5,"n_rows":29,"n_cols":6,"rows_kept":29,"cut":false,"hidden":false,"merged":[[12,4,12,5],[18,4,18,5],[13,4,13,5],[22,4,22,5]]}
[]
[]
[null,null," EWI Merit-Order Tool 2020"]
[]
[null,null," Impressum",null,null,{"$f":"CONCATENATE(\"Version \",F11,\" \")","v":"Version 2020.1.1 "}]
[]
[]
[null,null,null,"EWI Merit-Order Tool 2020"]
[]
[null,null," ","Energiewirtschaftliches Institut an der Universität zu Köln gGmbH (EWI)","Letzte Aktualisierung:","27.01.2020"]
[null,null,null,"Alte Wagenfabrik","Modellversion:","2020.1.1"]
[null,null,null,"Vogelsanger Straße 321a"]
[null,null,null,"50827 Köln"]
[null,null,null,"Tel.: +49 (0)221 277 29-100"]
[null,null,null,"Fax:  +49 (0)221 277 29-400"]
{"$rows_left_out":15}
{"sheet":"Start Reset","index":6,"n_rows":40,"n_cols":16,"rows_kept":40,"cut":false,"hidden":true,"merged":[[10,7,10,13],[6,2,6,5],[6,7,6,15],[7,7,7,13],[8,7,8,13],[9,7,9,13],[16,2,16,5],[20,2,20,5],[30,2,30,5],[30,7,30,10],[30,12,30,15]]}
[]
[]
[null,null," EWI Merit-Order Tool 2020"]
[]
[null,null," Start",null,null,null,null,null,null,null,null,null,null,null,null,{"$f":"Impressum!F5","v":"Version 2020.1.1 "}]
[]
[null,null,"Brennstoffkosten",null,null,null,null,"Übersicht über die Grenzkosten der Kraftwerke"]
[null,null,"Brennstoff","Kosten","Einheit","Quelle Standardwert",null,"   Das Boxplot-Diagramm gibt einen ersten Überblick über die Grenzkosten der Kraftwerke. In der Abbildung rechts"]
[null,null,"Kernenergie",5.5,"EUR/MWhth","siehe Dokumentation",null,"   werden die einzelnen Elemente des Diagramms erläutert. Veränderungen an den Annahmen gibt das Diagramm"]
[null,null,"Braunkohle",3.1,"EUR/MWhth","EWI (2019)",null,"   augenblicklich wieder. Um die Annahmen in die Merit-Order (Tabellenblatt: Merit-Order) zu übernehmen, muss die"]
[null,null,"Steinkohle",7.92,"EUR/MWhth","VDKi (2020)",null,"   Schaltfläche Aktualisiere Merit-Order aktiviert werden."]
[null,null,"Erdgas",13.57,"EUR/MWhth","Spot TTF"]
[null,null,"Öl",33.14,"EUR/MWhth","SDKW (2019)"]
[null,null,"Abfall",0,"EUR/MWhth","siehe Dokumentation"]
[null,null,"Sonstige",33.14,"EUR/MWhth","siehe Dokumentation"]
{"$rows_left_out":26}
{"sheet":"Backend I","index":7,"n_rows":534,"n_cols":5,"rows_kept":534,"cut":false,"hidden":true,"merged":[]}
["Index","Kraftwerktyp","Leistung","kumulierte Leistung","Grenzkosten"]
["BNA0084","Abfall",30.599999999999998,30.599999999999998,1]
["BNA0088b","Abfall",29.75,60.349999999999994,1]
["BNA0097","Abfall",28.9,89.25,1]
["BNA0117a","Abfall",10.199999999999999,99.45,1]
["BNA0139","Abfall",28.05,127.5,1]
["BNA0223b","Abfall",45.645000000000003,173.14500000000001,1]
["BNA0237","Abfall",19.974999999999998,193.12,1]
["BNA0287a","Abfall",22.099999999999998,215.22,1]
["BNA0287b","Abfall",39.524999999999999,254.745,1]
["BNA0380","Abfall",19.805,274.55,1]
["BNA0398","Abfall",20.399999999999999,294.95,1]
["BNA0407","Abfall",11.219999999999999,306.16999999999996,1]
["BNA0417","Abfall",19.125,325.29499999999996,1]
["BNA0438","Abfall",31.875,357.16999999999996,1]
{"$rows_left_out":520}
{"sheet":"Backend II","index":8,"n_rows":1004,"n_cols":10,"rows_kept":1004,"cut":false,"hidden":true,"merged":[]}
["Power","Erneuerbare Energien","Abfall","Kernenergie","Braunkohle","Steinkohle","GuD","Gasturbine","Öl","Sonstige"]
[0,0,1,0,0,0,0,0,0,0]
[1581.5359250000001,0,1,0,0,0,0,0,0,0]
[1581.5359250000001,0,0,17.866700000000002,0,0,0,0,0,0]
[10431.415925000001,0,0,17.866700000000002,0,0,0,0,0,0]
[10431.415925000001,0,0,0,32.018099999999997,0,0,0,0,0]
[10449.279925000001,0,0,0,32.018099999999997,0,0,0,0,0]
[10449.279925000001,0,0,0,32.186799999999998,0,0,0,0,0]
[10469.713525000001,0,0,0,32.186799999999998,0,0,0,0,0]
[10469.713525000001,0,0,0,32.357399999999998,0,0,0,0,0]
[12898.513525,0,0,0,32.357399999999998,0,0,0,0,0]
[12898.513525,0,0,0,0,0,32.656999999999996,0,0,0]
[13870.738525000001,0,0,0,0,0,32.656999999999996,0,0,0]
[13870.738525000001,0,0,0,32.704500000000003,0,0,0,0,0]
[14016.906525,0,0,0,32.704500000000003,0,0,0,0,0]
{"$rows_left_out":990}
{"sheet":"Kraftwerksliste Backend","index":9,"n_rows":553,"n_cols":12,"rows_kept":553,"cut":false,"hidden":true,"merged":[]}
[]
[]
[null,null," EWI Merit-Order Tool 2020"]
[]
[null,null," Kraftwerksliste",null,null,null,null,null,null,null,null,{"$f":"Impressum!F5","v":"Version 2020.1.1 "}]
[]
[null,null,"Kurze Erläuterung der Liste und der grundsätzlichen Datenquellen"]
[]
[]
[null,null,"Teil der Merit-Order?","Kraftwerksnummer Bundesnetzagentur","Unternehmen","Kraftwerksname","Blockname","Aufnahme der kommerziellen Stromerzeugung ","Zuordnung Kraftwerkstyp","Effizienz","Mittlere verfügbare\nNetto-Nennleistung [MW]","Grenzkosten [EUR/MWHel]"]
[null,null,"Nein","(optional)","(optional)","(optional)","(optional)","(optional)","(notwendig)","(notwendig)",0,0]
[null,null,"Nein","(optional)","(optional)","(optional)","(optional)","(optional)","(notwendig)","(notwendig)",0,0]
[null,null,"Nein","(optional)","(optional)","(optional)","(optional)","(optional)","(notwendig)","(notwendig)",0,0]
[null,null,"Nein","(optional)","(optional)","(optional)","(optional)","(optional)","(notwendig)","(notwendig)",0,0]
[null,null,"Nein","(optional)","(optional)","(optional)","(optional)","(optional)","(notwendig)","(notwendig)",0,0]
{"$rows_left_out":539}
{"sheet":"Hilfssheet Abbildung","index":10,"n_rows":26,"n_cols":9,"rows_kept":26,"cut":false,"hidden":true,"merged":[]}
[]
[null,null,"Abfall","Kernenergie","Braunkohle","Steinkohle","GuD","Gasturbine","Öl"]
[null,"Minimalwert",{"$f":"MIN(IF(Kraftwerksliste!$R$11:$R$553='Hilfssheet Abbildung'!C2,Kraftwerksliste!$Z$11:$Z$553,\"fail\"))","v":1},{"$f":"MIN(IF(Kraftwerksliste!$R$11:$R$553='Hilfssheet Abbildung'!D2,Kraftwerksliste!$Z$11:$Z$553,\"fail\"))","v":17.866666666666664},{"$f":"MIN(IF(Kraftwerksliste!$R$11:$R$553='Hilfssheet Abbildung'!E2,Kraftwerksliste!$Z$11:$Z$553,\"fail\"))","v":32.018067593466625},{"$f":"MIN(IF(Kraftwerksliste!$R$11:$R$553='Hilfssheet Abbildung'!F2,Kraftwerksliste!$Z$11:$Z$553,\"fail\"))","v":36.121198012796839},{"$f":"MIN(IF(Kraftwerksliste!$R$11:$R$553='Hilfssheet Abbildung'!G2,Kraftwerksliste!$Z$11:$Z$553,\"fail\"))","v":32.657011323909408},{"$f":"MIN(IF(Kraftwerksliste!$R$11:$R$553='Hilfssheet Abbildung'!H2,Kraftwerksliste!$Z$11:$Z$553,\"fail\"))","v":46.792725576927374},{"$f":"MIN(IF(Kraftwerksliste!$R$11:$R$553='Hilfssheet Abbildung'!I2,Kraftwerksliste!$Z$11:$Z$553,\"fail\"))","v":102.74393031650004}]
[null,"erstes Quartil",{"$f":"_xlfn.QUARTILE.INC(IF(Kraftwerksliste!$R$11:$R$553='Hilfssheet Abbildung'!C2,Kraftwerksliste!$Z$11:$Z$553,\"fail\"),1)","v":1},{"$f":"_xlfn.QUARTILE.INC(IF(Kraftwerksliste!$R$11:$R$553='Hilfssheet Abbildung'!D2,Kraftwerksliste!$Z$11:$Z$553,\"fail\"),1)","v":17.866666666666664},{"$f":"_xlfn.QUARTILE.INC(IF(Kraftwerksliste!$R$11:$R$553='Hilfssheet Abbildung'!E2,Kraftwerksliste!$Z$11:$Z$553,\"fail\"),1)","v":34.663974764088401},{"$f":"_xlfn.QUARTILE.INC(IF(Kraftwerksliste!$R$11:$R$553='Hilfssheet Abbildung'!F2,Kraftwerksliste!$Z$11:$Z$553,\"fail\"),1)","v":40.51761742670304},{"$f":"_xlfn.QUARTILE.INC(IF(Kraftwerksliste!$R$11:$R$553='Hilfssheet Abbildung'!G2,Kraftwerksliste!$Z$11:$Z$553,\"fail\"),1)","v":38.028909828031715},{"$f":"_xlfn.QUARTILE.INC(IF(Kraftwerksliste!$R$11:$R$553='Hilfssheet Abbildung'!H2,Kraftwerksliste!$Z$11:$Z$553,\"fail\"),1)","v":51.524883227961197},{"$f":"_xlfn.QUARTILE.INC(IF(Kraftwerksliste!$R$11:$R$553='Hilfssheet Abbildung'!I2,Kraftwerksliste!$Z$11:$Z$553,\"fail\"),1)","v":107.46248940364208}]
[null,"Median",{"$f":"_xlfn.QUARTILE.INC(IF(Kraftwerksliste!$R$11:$R$553='Hilfssheet Abbildung'!C2,Kraftwerksliste!$Z$11:$Z$553,\"fail\"),2)","v":1},{"$f":"_xlfn.QUARTILE.INC(IF(Kraftwerksliste!$R$11:$R$553='Hilfssheet Abbildung'!D2,Kraftwerksliste!$Z$11:$Z$553,\"fail\"),2)","v":17.866666666666664},{"$f":"_xlfn.QUARTILE.INC(IF(Kraftwerksliste!$R$11:$R$553='Hilfssheet Abbildung'!E2,Kraftwerksliste!$Z$11:$Z$553,\"fail\"),2)","v":35.792100903856664},{"$f":"_xlfn.QUARTILE.INC(IF(Kraftwerksliste!$R$11:$R$553='Hilfssheet Abbildung'!F2,Kraftwerksliste!$Z$11:$Z$553,\"fail\"),2)","v":44.633046415924959},{"$f":"_xlfn.QUARTILE.INC(IF(Kraftwerksliste!$R$11:$R$553='Hilfssheet Abbildung'!G2,Kraftwerksliste!$Z$11:$Z$553,\"fail\"),2)","v":48.862371908178233},{"$f":"_xlfn.QUARTILE.INC(IF(Kraftwerksliste!$R$11:$R$553='Hilfssheet Abbildung'!H2,Kraftwerksliste!$Z$11:$Z$553,\"fail\"),2)","v":54.084885663230949},{"$f":"_xlfn.QUARTILE.INC(IF(Kraftwerksliste!$R$11:$R$553='Hilfssheet Abbildung'!I2,Kraftwerksliste!$Z$11:$Z$553,\"fail\"),2)","v":113.32280992127374}]
[null,"Drittes Quartil",{"$f":"_xlfn.QUARTILE.INC(IF(Kraftwerksliste!$R$11:$R$553='Hilfssheet Abbildung'!C2,Kraftwerksliste!$Z$11:$Z$553,\"fail\"),3)","v":1},{"$f":"_xlfn.QUARTILE.INC(IF(Kraftwerksliste!$R$11:$R$553='Hilfssheet Abbildung'!D2,Kraftwerksliste!$Z$11:$Z$553,\"fail\"),3)","v":17.866666666666664},{"$f":"_xlfn.QUARTILE.INC(IF(Kraftwerksliste!$R$11:$R$553='Hilfssheet Abbildung'!E2,Kraftwerksliste!$Z$11:$Z$553,\"fail\"),3)","v":40.364453260373907},{"$f":"_xlfn.QUARTILE.INC(IF(Kraftwerksliste!$R$11:$R$553='Hilfssheet Abbildung'!F2,Kraftwerksliste!$Z$11:$Z$553,\"fail\"),3)","v":47.184009247484454},{"$f":"_xlfn.QUARTILE.INC(IF(Kraftwerksliste!$R$11:$R$553='Hilfssheet Abbildung'!G2,Kraftwerksliste!$Z$11:$Z$553,\"fail\"),3)","v":51.455700629375315},{"$f":"_xlfn.QUARTILE.INC(IF(Kraftwerksliste!$R$11:$R$553='Hilfssheet Abbildung'!H2,Kraftwerksliste!$Z$11:$Z$553,\"fail\"),3)","v":62.549680213791333},{"$f":"_xlfn.QUARTILE.INC(IF(Kraftwerksliste!$R$11:$R$553='Hilfssheet Abbildung'!I2,Kraftwerksliste!$Z$11:$Z$553,\"fail\"),3)","v":123.20966342614085}]
[null,"Maximalwert",{"$f":"MAX(IF(Kraftwerksliste!$R$11:$R$553='Hilfssheet Abbildung'!C2,Kraftwerksliste!$Z$11:$Z$553,\"fail\"))","v":1},{"$f":"MAX(IF(Kraftwerksliste!$R$11:$R$553='Hilfssheet Abbildung'!D2,Kraftwerksliste!$Z$11:$Z$553,\"fail\"))","v":17.866666666666664},{"$f":"MAX(IF(Kraftwerksliste!$R$11:$R$553='Hilfssheet Abbildung'!E2,Kraftwerksliste!$Z$11:$Z$553,\"fail\"))","v":67.167699743661004},{"$f":"MAX(IF(Kraftwerksliste!$R$11:$R$553='Hilfssheet Abbildung'!F2,Kraftwerksliste!$Z$11:$Z$553,\"fail\"))","v":76.783371176127346},{"$f":"MAX(IF(Kraftwerksliste!$R$11:$R$553='Hilfssheet Abbildung'!G2,Kraftwerksliste!$Z$11:$Z$553,\"fail\"))","v":107.43383850129199},{"$f":"MAX(IF(Kraftwerksliste!$R$11:$R$553='Hilfssheet Abbildung'!H2,Kraftwerksliste!$Z$11:$Z$553,\"fail\"))","v":70.087285979103456},{"$f":"MAX(IF(Kraftwerksliste!$R$11:$R$553='Hilfssheet Abbildung'!I2,Kraftwerksliste!$Z$11:$Z$553,\"fail\"))","v":133.64121710007277}]
[]
[]
[null,null,"Abfall","Kernenergie","Braunkohle","Steinkohle","GuD","Gasturbine","Öl"]
[null,"Q1-Minimum",null,null,{"$f":"E4-E3","v":2.6459071706217756},4.3964194139062016,5.3718985041223064,4.7321576510338232,{"$f":"I4-I3","v":4.7185590871420402}]
[null,"Q1",{"$f":"C4","v":1},{"$f":"D4","v":17.866666666666664},{"$f":"E4","v":34.663974764088401},40.51761742670304,38.028909828031715,51.524883227961197,{"$f":"I4","v":107.46248940364208}]
[null,"Median-Q1",{"$f":"C5-C4+0.1","v":0.1},{"$f":"D5-D4+0.1","v":0.1},{"$f":"E5-E4","v":1.1281261397682627},4.1154289892219182,10.833462080146518,2.5600024352697517,{"$f":"I5-I4","v":5.8603205176316635}]
[null,"Q3-Median",{"$f":"C6-C5+0.1","v":0.1},{"$f":"D6-D5+0.1","v":0.1},{"$f":"E6-E5","v":4.5723523565172428},2.5509628315594952,2.5933287211970821,8.4647945505603843,{"$f":"I6-I5","v":9.8868535048671049}]
[null,"Maximum-Q3",null,null,{"$f":"E7-E6","v":26.803246483287097},29.599361928642892,55.978137871916672,7.5376057653121222,{"$f":"I7-I6","v":10.431553673931916}]
{"$rows_left_out":11}